{"text_format":"2","workbook":"xlsx","n_sheets":9,"sheets":["Intro","Block Calving","Block calving KPIs","Sheet2","Block graph calcs - HIDE","AYR calving","AYR KPIs","AYR graph calcs - HIDE","KPI definitions"],"not_rendered":{"charts":40,"images":6,"macros":0,"external_links":0,"defined_names":2,"comments":5,"pivot_tables":0},"unopened":[],"bounds":{"document_bytes":16777216,"sheet_cells":100000,"run_cost":"one","rows_first":2000,"rows_last":500,"rows_between":2000,"halvings":0,"cell_chars":16384,"cell_head_chars":4096},"cells_cut":0,"cells_raw":0,"read":"whole","date_system":"1900"}

{"sheet":"Intro","index":0,"n_rows":7,"n_cols":4,"rows_kept":7,"cut":false,"hidden":false,"merged":[]}
[]
[]
[]
[null,null,"Dairy systems key performance indicator tool"]
[]
[]
[null,null,null,"Which calving system do you use?"]

{"sheet":"Block Calving","index":1,"n_rows":102,"n_cols":7,"rows_kept":102,"cut":false,"hidden":false,"merged":[[11,1,11,4],[91,1,91,4],[13,1,13,4],[15,1,15,4],[14,1,14,4],[54,2,54,4],[59,2,59,4],[5,1,5,4],[7,1,7,4],[8,1,8,4],[6,1,6,4],[10,1,10,4],[9,1,9,4],[100,0,100,6],[101,0,101,6],[44,1,49,1],[50,1,53,1],[54,1,60,1],[61,1,79,1],[95,1,95,4],[82,1,87,1]]}
[]
[null,"If you already know your KPIs please enter them in the white boxes below"]
[null,"Please note if you have a KPI value but want a new one calculated, leave the row blank for that KPI"]
[null,"Move your mouse over red triangles for more information"]
[null,"Dairy enterprise KPIs - block calving"]
[null,"Cows and heifers calved within the first 6 weeks",{"$nulls":4},"%"]
[null,"Herd replacement rate",{"$nulls":4},"%"]
[null,"Solids output per ha",{"$nulls":4},"kg milk solids/ha"]
[null,"Milk yield from forage (litres)",{"$nulls":4},"litres"]
[null,"Milk yield from forage (milk solids)",{"$nulls":4},"kg milk solids"]
[null,"Overheads (excluding rent and finance)",{"$nulls":4},"ppl"]
[null,"Genetic merit",{"$nulls":4},"Percentile"]
[null,"Business financial measures"]
[null,"Full economic net margin",{"$nulls":4},"ppl"]
[null,"Full economic costs of production",{"$nulls":4},"ppl"]
{"$rows_left_out":88}
{"sheet":"Block calving KPIs","index":2,"n_rows":23,"n_cols":6,"rows_kept":23,"cut":false,"hidden":false,"merged":[[0,1,1,12],[11,1,11,5]]}
[null,"Block Calving KPIs"]
[]
[]
[null,"Dairy enterprise KPIs","Excellent","Good","Average","Your Performance"]
[null,"Cows and heifers calved within the first 6 weeks",">90%",0.8,0.7,{"$f":"IF(ISBLANK('Block Calving'!F6),'Block Calving'!F32/'Block Calving'!F33,'Block Calving'!F6)","v":{"$error":"#DIV/0!"}}]
[null,"Herd replacement rate","<20%",0.22,0.26,{"$f":"IF(ISBLANK('Block Calving'!F7),'Block Calving'!F34/'Block Calving'!F31,'Block Calving'!F7)","v":{"$error":"#DIV/0!"}}]
[null,"Solids output (kg milk solids per ha)",">1,500",1250,1100,{"$f":"IF(ISBLANK('Block Calving'!F8),('Block Calving'!F22*1.03)*('Block Calving'!F23+'Block Calving'!F24)/'Block Calving'!F27,'Block Calving'!F8)","v":{"$error":"#DIV/0!"}}]
[null,"Milk yield from forage (litres)",">5,000",4000,2750,{"$f":"IF(ISBLANK('Block Calving'!F9),('Block Calving'!F22/'Block Calving'!F31)-('Block Calving'!F28/0.45),'Block Calving'!F9)","v":{"$error":"#DIV/0!"}}]
[null,"Milk yield from forage (kg milk solids)",">427",342,235,{"$f":"IF(ISBLANK('Block Calving'!F10),(('Block Calving'!F22/'Block Calving'!F31)-('Block Calving'!F28/0.45))*1.03*('Block Calving'!F23+'Block Calving'!F24),'Block Calving'!F10)","v":{"$error":"#DIV/0!"}}]
[null,"Overheads* (ppl)",9,10.5,12.5,{"$f":"IF(ISBLANK('Block Calving'!F11),SUM('Block Calving'!F62:F77)/'Block Calving'!F22*100,'Block Calving'!F11)","v":{"$error":"#DIV/0!"}}]
[null,"Genetic Merit ",0.05,0.25,0.5,{"$f":"IF(ISBLANK('Block Calving'!F12),IF(ISBLANK('Block Calving'!F92),IF(ISBLANK('Block Calving'!F96),\"#DIV/0!\",'Block Calving'!F96),IF(ISBLANK('Block Calving'!F96),'Block Calving'!F92,(('Block Calving'!F95*'Block Calving'!F96)+('Block Calving'!F91*'Block Calving'!F92))/SUM('Block Calving'!F91,'Block Calving'!F95))),'Block Calving'!F12)","v":"#DIV/0!"}]
[null,"*excluding rent and finance                                                                                                                      Please note that any user-provided KPI values are displayed over calculated values"]
[]
[]
[]
{"$rows_left_out":9}
{"sheet":"Sheet2","index":3,"n_rows":16,"n_cols":7,"rows_kept":16,"cut":false,"hidden":true,"merged":[]}
[]
[null,"6-wk calving rate"]
[null,"Deviation on optimum calving block","2 weeks longer","4 weeks longer","6 weeks longer","8 weeks longer"]
[null,"Impact on profit per cow",-0.05,-0.1,-0.24,-0.38]
[]
[]
["block (weeks)",6,8,10,12,14]
["% in 1st 6wk (if linear)",1,{"$f":"$B$7/C7","v":0.75},{"$f":"$B$7/D7","v":0.6},0.5,0.42857142857142855]
["Impact on prof per cow",0,-0.05,-0.1,-0.24,-0.38]
[]
["block (weeks)","% in 1st 6wk (if linear)","Impact on prof per cow"]
[14,0.42857142857142855,-0.38,null,null,0.8,{"$f":"VLOOKUP(F12,B11:C16,2,TRUE)","v":-0.05}]
[12,0.5,-0.24]
[10,0.6,-0.1]
[8,0.75,-0.05]
{"$rows_left_out":2}
{"sheet":"Block graph calcs - HIDE","index":4,"n_rows":89,"n_cols":33,"rows_kept":89,"cut":false,"hidden":true,"merged":[[12,27,12,30],[10,27,10,30],[11,27,11,30],[2,27,2,30],[3,27,3,30],[4,27,4,30],[5,27,5,30],[6,27,6,30],[7,27,7,30],[8,27,8,30]]}
[null,null,"Cows calved within the first 6 weeks"]
[null,null,null,"Average","Good","Excellent","Overcooked performance","Range max",{"$nulls":19},"TEST NUMBER SET"]
[null,null,"Performance targets",0.7,0.8,0.9,"n/a",1,{"$nulls":19},"Cows and heifers calved within the first 6 weeks",null,null,null,0.85,"%"]
[null,null,null,"Trigger: below average","Above average","Good","Excellent",{"$nulls":20},"Herd replacement rate",null,null,null,0.25,"%"]
[null,null,"Target ranges",{"$f":"D3","v":0.7},{"$f":"E3-D3","v":0.10000000000000009},{"$f":"F3-E3","v":9.9999999999999978E-2},{"$f":"H3-F3","v":9.9999999999999978E-2},{"$nulls":4},"Dairy enterprise KPIs","Average","Good","Excellent","Grey",{"$nulls":11},"Solids output per ha",null,null,null,1100,"kg milk solids/ha"]
[null,null,"Actual performance",{"$f":"'Block calving KPIs'!F5","v":{"$error":"#DIV/0!"}},{"$nulls":7},"Cows and heifers calved within the first 6 weeks",0.57999999999999996,0.75,0.9,{"$nulls":12},"Milk yield from forage",null,null,null,4500,"litres"]
[null,null,"performance calc",{"$f":"D6-(D8/2)","v":{"$error":"#DIV/0!"}},{"$nulls":7},"Solids output (kg milk solids per ha)",1000,1150,1250,{"$nulls":12},"     Milk yield from forage (milk solids)",null,null,null,{"$f":"AF6*0.082","v":369},"kg milk solids"]
[null,null,"performance width",6.0000000000000001E-3,{"$nulls":7},"Milk yield from forage (litres)",2600,3300,4000,{"$nulls":12},"Overheads (excluding rent and finace)",null,null,null,9,"ppl"]
[{"$nulls":11},"Herd replacement rate",0.25,0.21,0.18,0.18,{"$nulls":11},"Genetic merit",null,null,null,0.45,"Percentile"]
[null,null,"Herd Replacement rate (%)",{"$nulls":8},"Overheads* as a proportion of income",0.41,0.37,0.3,{"$nulls":12},"Business financial measures"]
[null,null,"Overcooked performance","Excellent performance","Good performance","Average performance",null,"Range max",null,null,null,"Genetic Merit ",0.5,0.25,0.1,{"$nulls":12},"Full economic costs of production",null,null,null,25,"ppl"]
[null,"Performance targets",0.18,0.2,0.22,0.26,null,1,{"$nulls":19},"Return on tenants-type capital",null,null,null,0.13,"%"]
[null,null,"Review","Excellent","Good","Above average","Trigger: below average",{"$nulls":20},"Full economic net margin",null,null,null,5,"ppl"]
[null,"Target ranges",{"$f":"C12","v":0.18},{"$f":"D12-C14","v":2.0000000000000018E-2},{"$f":"E12-D12","v":1.999999999999999E-2},{"$f":"F12-E12","v":4.0000000000000008E-2},{"$f":"H12-F12","v":0.74}]
[null,"Actual performance",null,{"$f":"'Block calving KPIs'!F6","v":{"$error":"#DIV/0!"}}]
{"$rows_left_out":75}
{"sheet":"AYR calving","index":5,"n_rows":112,"n_cols":7,"rows_kept":112,"cut":false,"hidden":false,"merged":[[31,1,33,2],[10,1,10,4],[27,1,28,2],[29,1,30,2],[82,1,87,1],[111,0,111,6],[110,0,110,6],[61,1,79,1],[5,1,5,4],[6,1,6,4],[7,1,7,4],[8,1,8,4],[59,2,59,4],[9,1,9,4],[12,1,12,4],[14,1,14,4],[13,1,13,4],[54,2,54,4],[44,1,49,1],[50,1,53,1],[54,1,60,1]]}
[]
[null,"If you already know your KPIs please enter them in the white boxes below"]
[null,"Please note if you have a KPI value but want a new one calculated, leave the row blank for that KPI"]
[null,"Move your mouse over red triangles for more information"]
[null,"Dairy enterprise KPIs - all year round calving"]
[null,"Pregnancy rate",{"$nulls":4},"%"]
[null,"Age at first calving",{"$nulls":4},"months"]
[null,"Total purchased feed costs",{"$nulls":4},"ppl"]
[null,"Average daily lifetime yield",{"$nulls":4},"litres/day"]
[null,"Overheads (excluding rent and finance)",{"$nulls":4},"ppl"]
[null,"Genetic Merit",{"$nulls":4},"percentile"]
[null,"Business financial measures"]
[null,"Full economic net margin",{"$nulls":4},"ppl"]
[null,"Full economic costs of production",{"$nulls":4},"ppl"]
[null,"Return on tenants-type capital",{"$nulls":4},"%"]
{"$rows_left_out":98}
{"sheet":"AYR KPIs","index":6,"n_rows":22,"n_cols":14,"rows_kept":22,"cut":false,"hidden":false,"merged":[[0,1,1,12],[10,1,10,5],[11,1,11,5],[6,13,7,16]]}
[null,"All Year Round Calving KPIs"]
[]
[]
[null,"Dairy enterprise KPIs","Excellent","Good","Average","Your Performance"]
[null,"Pregnancy rate",">25%",0.2,0.14000000000000001,{"$f":"IF(ISBLANK('AYR calving'!$F$6),('AYR calving'!F33/'AYR calving'!F32)*('AYR calving'!F34/'AYR calving'!F33),'AYR calving'!$F$6)","v":{"$error":"#DIV/0!"}}]
[null,"Age at first calving (months)",23,24,27.5,{"$f":"IF(ISBLANK('AYR calving'!$F$7),'AYR calving'!F28/'AYR calving'!F29,'AYR calving'!$F$7)","v":{"$error":"#DIV/0!"}}]
[null,{"$f":"CONCATENATE(\"Total purchased feed costs (ppl) - \",'AYR calving'!F25,\"L/cow\")","v":"Total purchased feed costs (ppl) - L/cow"},{"$f":"IF(ISBLANK('AYR calving'!$F$25),\"#N/A\",IF('AYR calving'!$F$25<9001,7,IF('AYR calving'!$F$25>11000,8,7.8)))","v":"#N/A"},{"$f":"IF(ISBLANK('AYR calving'!$F$25),\"#N/A\",IF('AYR calving'!$F$25<9001,7.5,IF('AYR calving'!$F$25>11000,8.5,8.5)))","v":"#N/A"},{"$f":"IF(ISBLANK('AYR calving'!$F$25),\"#N/A\",IF('AYR calving'!$F$25<9001,8,IF('AYR calving'!$F$25>11000,9.5,9)))","v":"#N/A"},{"$f":"IF(ISBLANK('AYR calving'!$F$8),'AYR calving'!F45/'AYR calving'!F22*100,'AYR calving'!$F$8)","v":{"$error":"#DIV/0!"}},{"$nulls":7},"  If this graph isn't showing check you have entered a value into the \"Approx. annual yield per cow\" row on the AYR input spreadsheet"]
[null,"Average daily lifetime yield (litres/day)",">19",14.5,12.5,{"$f":"IF(ISBLANK('AYR calving'!$F$9),'AYR calving'!F31/'AYR calving'!F30,'AYR calving'!$F$9)","v":{"$error":"#DIV/0!"}}]
[null,"Overheads* (ppl)",9,10,12.5,{"$f":"IF(ISBLANK('AYR calving'!$F$10),SUM('AYR calving'!F62:F77)/'AYR calving'!F22*100,'AYR calving'!$F$10)","v":{"$error":"#DIV/0!"}}]
[null,"Genetic Merit ",0.05,0.25,0.5,{"$f":"IF(ISBLANK('AYR calving'!F11),SUMPRODUCT('AYR calving'!F91:F98,'AYR calving'!F99:F106)/SUM('AYR calving'!F91:F98),'AYR calving'!F11)","v":{"$error":"#DIV/0!"}}]
[null,"*excluding rent and finance"]
[null,"Please note that any user-provided KPI values are displayed over calculated values"]
[]
[]
[]
{"$rows_left_out":8}
{"sheet":"AYR graph calcs - HIDE","index":7,"n_rows":80,"n_cols":33,"rows_kept":80,"cut":false,"hidden":true,"merged":[[10,27,10,30],[11,27,11,30],[9,27,9,30],[2,27,2,30],[3,27,3,30],[4,27,4,30],[5,27,5,30],[6,27,6,30],[7,27,7,30]]}
[null,null,"Pregnancy rate"]
[null,null,null,"Average","Good","Excellent","Overcooked performance","Range max",{"$nulls":19},"TEST NUMBER SET"]
[null,null,"Performance targets",0.14000000000000001,0.2,0.25,"n/a",1,{"$nulls":19},"Pregnancy rate",null,null,null,0.23,"%"]
[null,null,null,"Trigger: below average","Above average","Good","Excellent",{"$nulls":20},"Age at first calving",null,null,null,24,"months"]
[null,null,"Target ranges",{"$f":"D3","v":0.14000000000000001},{"$f":"E3-D3","v":0.06},{"$f":"F3-E3","v":4.9999999999999989E-2},{"$f":"H3-F3","v":0.75},{"$nulls":4},"Dairy enterprise KPIs","Average","Good","Excellent","Grey",{"$nulls":11},"Total purchased feed costs",null,null,null,8,"ppl"]
[null,null,"Actual performance",{"$f":"'AYR KPIs'!F5","v":{"$error":"#DIV/0!"}},{"$nulls":7},"Cows and heifers calved within the first 6 weeks",0.57999999999999996,0.75,0.9,{"$nulls":12},"Average daily lifetime yield",null,null,null,15,"litres/day"]
[null,null,"performance calc",{"$f":"D6-(D8/2)","v":{"$error":"#DIV/0!"}},{"$nulls":7},"Solids output (kg milk solids per ha)",1000,1150,1250,{"$nulls":12},"Overheads (excluding rent and finace)",null,null,null,8,"ppl"]
[null,null,"performance width",3.0000000000000001E-3,{"$nulls":7},"Milk yield from forage (litres)",2600,3300,4000,{"$nulls":12},"Genetic Merit",null,null,null,0.6,"percentile"]
[{"$nulls":11},"Herd replacement rate",0.25,0.21,0.18,0.18,{"$nulls":11},"Business financial measures"]
[null,null,"Age at first calving",{"$nulls":8},"Overheads* as a proportion of income",0.41,0.37,0.3,{"$nulls":12},"Full economic costs of production",null,null,null,28,"ppl"]
[null,null,"Overcooked performance","Excellent performance","Good performance","Average performance",null,"Range max",null,null,null,"Genetic Merit ",0.5,0.25,0.1,{"$nulls":12},"Return on tenants-type capital",null,null,null,0.18,"%"]
[null,"Performance targets",22,23,24,27.5,null,30,{"$nulls":19},"Full economic net margin",null,null,null,5,"ppl"]
[null,null,"Review","Excellent","Good","Above average","Trigger: below average"]
[null,"Target ranges",{"$f":"C12","v":22},{"$f":"D12-C12","v":1},{"$f":"E12-D12","v":1},{"$f":"F12-E12","v":3.5},{"$f":"H12-F12","v":2.5}]
[null,"Actual performance",null,{"$f":"'AYR KPIs'!F6","v":{"$error":"#DIV/0!"}}]
{"$rows_left_out":66}
{"sheet":"KPI definitions","index":8,"n_rows":32,"n_cols":10,"rows_kept":32,"cut":false,"hidden":false,"merged":[[22,2,22,4],[31,1,57,1],[31,2,57,7],[30,2,30,7]]}
["Optimal Dairy Systems KPI definitions"]
[]
[null,"BLOCK CALVING SYSTEMS (calve in 12 week block)"]
[null,"Dairy Enterprise KPIs","Excellent                      (Top 5% performer or aspirational target)","Good                           (Top 25% performance)","Average                 (Industry average where available)","Definitions","Figures required","Example calculation","Points to note","Reason KPI selected"]
[null,"Cows & heifers calved within the first 6 weeks (%)",">90%",0.8,0.7,"Number of cows and heifers calved in the first 6 weeks from the planned start of calving\n÷\nTotal number of cows and heifers due to calve\n×\n100\n=\n6 week calving rate %\n\n","● Number of cows (incl' heifers) calved in first 6 weeks \n● Total number of cows to calve\n                                                                                                                       ","90 cows calved\n÷\n100 cows & heifers in-calf\n×\n100\n=\n90%","● Should include served heifers (AI or natural)\n● Should not include cows and heifers that haven't been served","Good fertility to achieve a tight block is key to a profitable block calving herd.  A tight calving period can lead to more days in milk. If the target 6 week calving rate is not being reached it is an indicator of issues such as fertility and /or cow management. "]
[null,"Herd replacement rate (%)","<20%",0.22,0.26,"The number of animals required to replace cows that have left the herd (including voluntary culls, involuntary culls, deaths, and sold milking animals) during a defined period (usually 12 months) expressed as a percentage of the average herd size during the same period.","● Number of cull cows, voluntary and involuntary cull cows\n● Number of cow deaths\n● Number of milking animals sold\n● Number of cows in herd\n                                                                         ","11 voluntary cull cows\n+\n2 involuntary cull cows\n+\n1 cow deaths\n+\n10 milking animals sold\n=\n24 cows\n÷\n100 cows in herd\nx\n100\n=\n24% herd replacement rate","● Cows that were TB reactors and culled would be included as involuntary culls","Fewer replacement animals required, through increased cow longevity, results in lower costs and higher lifetime productivity."]
[null,"Milk solids output per hectare (kg MS/ha)",">1500kg/ha","1250kg/ha","1100kg/ha","Milk yield (kg MS)                                                                                                                                                                                                                                                                                                     ÷                                                                                                                                                                                                                                                                                                                                    Total grazing and silage area used only for milking cows                                                                                                                                                      =                                                                                                                                                                           Milk solids output per hectare (kg MS/ha)\n\n","● 12 month milk production in litres\n● 12 month average butterfat and protein %\n● Total hectares used by the milking herd for grazing and silage\n             ","84,460kg milk solids yield\n[(1,000,000 litres x 1.03*) x (4.6% butterfat + 3.6% protein ÷ 100) = 1,030,000kg x 0.082]\n÷\n75 ha total grazing and silage area\n=\n*converts litres to kg of milk","● Total forage area should include the grazing on the milking platform plus any area that is used to produce forage (ie grass silage, maize etc) for milking and dry cows only\n● Only include areas of silage, maize etc that went to the dairy herd\n● Exclude areas exclusively used by youngstock or other livestock                                                                                    ","This is a calculation based on a combination of yield per cow and stocking rate per hectare. Profitable dairy farming is strongly linked to the amount of grass that is harvested per hectare and together with supplementary feed, how efficiently that grass is converted into milk solids. Milk solids yield per hectare records the amount of milk fat and protein produced per hectare. However this can be limited by the land capability, although knowing the optimum stocking rate for the farm will help optimise the production per hectare without impacting profitability."]
[null,"Milk yield from forage (litres) and (solids)",">5,000l   (427kg)","4,000l      (342kg)","2,750l         (235kg)","Total annual milk production\n ÷\nAverage number of cows in herd = Milk yield per cow\n-\nThe milk produced by concentrates\n=\nMilk from forage\n","● 12 month milk production in litres\n● Average number of cows in the herd\n● Average kilos of concentrate fed per cow\n             ","1,000,000 litres annual milk production\n÷\n130 cows in herd = 7692 litres/cow/year                                                                                                                                                                                                                           -                                                                                                                                                                                                                                                                                                                                    4444 litres/cow/year from concentrates (2000kg/cow/year of concentrate used ÷ 0.45*)\n=\n3248 litres/cow/year from forage (7692 litres – 4444 litres)                                                                                                                                                                                                                                                                  *this is the amount of concentrate at 13.5MJME/kgDM to produce 1 litre of standard milk\n","● Concentrates are anything but forage","Regardless of the farming system quality forage (particularly grazed grass) will always be the cheapest form of feed. The more milk produced from forage the greater the profitability. "]
[null,"Overheads (excluding rent and finance)","9ppl","10.5ppl","12.5ppl","Overheads of the herd but excluding the rent and finance","For a 12 month period\nCASH OVERHEADS\n● Paid labour\n● Machinery repairs, spares, tax and insurance\n● Machinery hire and contracting\n● Electricity and fuel\n● Building repairs\n● Water\n● Telephone, general insurances, professional fees\n● Miscellaneous\nOTHER OVERHEAD COSTS\n● Machinery and dairy facilities/buildings depreciation\n● Value of unpaid labour (standardise at £30,000/full time equivalent \nTOTAL MILK PRODUCED (litres)","£34,000 Cash overheads\n+\n£30,000 machinery and buildings depreciation\n+\n£30,000 unpaid labour value  (£30,000 per full-time family person)\n=\n£94,000 total overheads (excluding rent and finance)\n÷\n1,000,000 litres milk produced\nx\n100\n=\n9.4ppl","● Based on Comparable Farm Profit benchmarking which omits rent and finance\n● Uses unpaid labour cost of £30,000 per full-time person","Overhead costs are one of the largest sources of variation in the cost of production. Labour, power and machinery are all inter-related, so it is important to measure overheads in detail and benchmark where the best farmers are, find detailed areas to focus on and set targets to lower the cost base. Collecting this data and setting SMART targets will help all dairy farmers assess their business overheads and improve. "]
[null,"Genetic merit","5th percentile","25th percentile","50th percentile","This is the percentile your average £ACI score (for autumn calving) or £SCI (for spring calving) falls into compared with the average GB milk-recorded herd. For more information on how to obtain this value please refer to the 'how to get your genetic merit value' section below. ","See ‘How to get your genetic merit value’ section below","See ‘How to get your genetic merit value’ section below","Fully milk recording herds can find their average milking herd genetic merit for either the £PLI (all year round or autumn block calving) or £SCI (spring block calving) through the AHDB Dairy Herd Genetic Report (HGR).  Fully milk recording herds are those recording on an ICAR approved scheme at a minimum of 5 times within a lactation. During these recordings each cows has its milk yield recorded and milk samples taken.","The performance of a dairy herd is determined by two factors, the management of the herd and the genetics of the herd.  Therefore, in order to drive progress and improve their performance through the Optimal Dairy Systems genetics must be a consideration."]
[]
[]
[null,"ALL YEAR ROUND CALVING (not 12 week block calving)"]
[null,"Dairy Enterprise KPIs","Excellent                      (Top 5% performer or aspirational target)","Good                           (Top 25% performance)","Average                 (Industry average where available)","Definitions","Figures required","Example calculation","Points to note","Reason KPI selected"]
[null,"Pregnancy rate (%)",">25%",0.2,0.14000000000000001,"Pregnancy rate (also known as the  % cows eligible for service that conceived) is the percentage of cows eligible to be bred in any 21-day period (following a 50-day voluntary waiting period) that are served and hold in calf. \n\n","● Figures from the latest group of calved cows or rolling yearly average\n● Number of cows eligible to become pregnant\n● Number of cows inseminated\n● Number of cows that became pregnant                                          ","50 open cows are eligible to become pregnant (after a 50-day voluntary waiting period)\n\n30 cows are inseminated (30 of 50 open cows) = 60% submission rate\n\n12 cows become pregnant (12 of 30 inseminated cows) = 40% conception rate\n\n60% submission rate\nx\n40% conception rate\n=\n24% pregnancy rate for this 21-day period\nOR\n12 pregnant cows\n÷\n50 eligible cows\nx\n100\n=\n24% pregnancy rate for this 21-day period","● Use on-farm software if available (eg UNIFORM or DC305, Interherd/Interherd+ and Total Vet) \n● If software not available, calculate using the latest group of cows that calved and work back to their insemination\n● A 50 day voluntary waiting period is used to standardise the figures for comparability","If any genetic merit is to be passed from one generation to the next fertility is key. Pregnancy rate provides an overall measure of the herd’s fertility and is comparable between farms and systems. It is fundamental to increasing the daily weight of milk sold per cow as well as generating calves for replacement or sale. \nPregnancy rate is the best way of measuring the efficiency of pregnancy production as it is real time and takes into account the whole herd unlike other measures of fertility and so has a real impact on profitability.\n\n"]
{"$rows_left_out":17}